{"text_format":"1","workbook":"xlsx","n_sheets":4,"sheets":["EINGABE Name + Funktion","SVSE Cheque bedrucken","Couvert drucken","Start"],"not_rendered":{"charts":0,"images":5,"macros":1,"external_links":0,"defined_names":5,"comments":1,"pivot_tables":0},"unopened":[],"bounds":{"document_bytes":16777216,"sheet_cells":100000,"rows_first":2000,"rows_last":500,"rows_between":2000,"halvings":0,"cell_chars":16384,"cell_head_chars":4096},"cells_cut":0,"cells_raw":0,"read":"whole","date_system":"1900"}

{"sheet":"EINGABE Name + Funktion","index":0,"n_rows":207,"n_cols":26,"rows_kept":207,"cut":false,"hidden":false,"merged":[[5,17,5,19],[5,20,5,22],[0,2,3,11]]}
[null,null,"SVSE Urlaubs-Cheque Bestellung",null,null,null,null,null,null,null,null,null,null,null,null,null,"Anleitung:","Die Makros müssen aktiviert werden. "]
[null,null,null,null,null,null,null,null,null,null,null,null,null,null,null,null,null,"Hier die Daten erfassen. Sobald Ihr die Daten eingegeben habt, wird das gelbe Feld weiss. "]
[null,null,null,null,null,null,null,null,null,null,null,null,null,null,null,null,null,"Feld H (Check Nr) wird durch mich ausgefüllt. "]
[null,null,null,null,null,null,null,null,null,null,null,null,null,null,null,null,null,"Die Adresse ist nur 1x zu erfassen wenn es sich um die gleiche Person handelt. "]
[null,null,null,null,null,null,null,null,null,null,null,null,null,null,null,null,null,"Den Button Inhalte leeren, werden alle erfassten Daten von Euch gelöscht. "]
[null,"Name + Vorname","Beschäftigung","Arbeitsort","Datum\ndes Urlaubs","Grund","Konto","1 \nTag","1/2\nTag","Check\nNr.","Bezug\nnational","Bezug\nInternational","Verein","Adresse","PLZ","Ort",null,"Version: 2.0  / 29.12.2025\nerstellt durch M.Brupbacher",null,null,"E-Mail:\nmartin.brupbacher@svse.ch"]
[null,null,null,null,null,null,null,null,null,null,null,null,null,null,null,null,null,"Check Nr.","Ausgang","Eingang","Name","Konto","Umlauf","Nat.","Intern.","Datum"]
[1,null,null,null,null,null,null,null,null,null,null,null,null,null,null,null,null,{"$f":"J8","v":0},{"$f":"TODAY()","v":"2025-12-29"},{"$f":"S8","v":"2025-12-29"},{"$f":"B8","v":0},{"$f":"G8","v":0},null,{"$f":"K8","v":0},{"$f":"L8","v":0},{"$f":"E8","v":"00:00:00"}]
[2,null,null,null,null,null,null,null,null,null,null,null,null,null,null,null,null,{"$f":"J9","v":0},{"$f":"TODAY()","v":"2025-12-29"},{"$f":"S9","v":"2025-12-29"},{"$f":"B9","v":0},{"$f":"G9","v":0},null,{"$f":"K9","v":0},{"$f":"L9","v":0},{"$f":"E9","v":"00:00:00"}]
[3,null,null,null,null,null,null,null,null,null,null,null,null,null,null,null,null,0,"2025-12-29","2025-12-29",0,0,null,0,0,"00:00:00"]
[4,null,null,null,null,null,null,null,null,null,null,null,null,null,null,null,null,0,"2025-12-29","2025-12-29",0,0,null,0,0,"00:00:00"]
[5,null,null,null,null,null,null,null,null,null,null,null,null,null,null,null,null,0,"2025-12-29","2025-12-29",0,0,null,0,0,"00:00:00"]
[6,null,null,null,null,null,null,null,null,null,null,null,null,null,null,null,null,0,"2025-12-29","2025-12-29",0,0,null,0,0,"00:00:00"]
[7,null,null,null,null,null,null,null,null,null,null,null,null,null,null,null,null,0,"2025-12-29","2025-12-29",0,0,null,0,0,"00:00:00"]
[8,null,null,null,null,null,null,null,null,null,null,null,null,null,null,null,null,0,"2025-12-29","2025-12-29",0,0,null,0,0,"00:00:00"]
[9,null,null,null,null,null,null,null,null,null,null,null,null,null,null,null,null,0,"2025-12-29","2025-12-29",0,0,null,0,0,"00:00:00"]
[10,null,null,null,null,null,null,null,null,null,null,null,null,null,null,null,null,0,"2025-12-29","2025-12-29",0,0,null,0,0,"00:00:00"]
[11,null,null,null,null,null,null,null,null,null,null,null,null,null,null,null,null,0,"2025-12-29","2025-12-29",0,0,null,0,0,"00:00:00"]
[12,null,null,null,null,null,null,null,null,null,null,null,null,null,null,null,null,0,"2025-12-29","2025-12-29",0,0,null,0,0,"00:00:00"]
[13,null,null,null,null,null,null,null,null,null,null,null,null,null,null,null,null,0,"2025-12-29","2025-12-29",0,0,null,0,0,"00:00:00"]
[14,null,null,null,null,null,null,null,null,null,null,null,null,null,null,null,null,0,"2025-12-29","2025-12-29",0,0,null,0,0,"00:00:00"]
[15,null,null,null,null,null,null,null,null,null,null,null,null,null,null,null,null,0,"2025-12-29","2025-12-29",0,0,null,0,0,"00:00:00"]
[16,null,null,null,null,null,null,null,null,null,null,null,null,null,null,null,null,0,"2025-12-29","2025-12-29",0,0,null,0,0,"00:00:00"]
[17,null,null,null,null,null,null,null,null,null,null,null,null,null,null,null,null,0,"2025-12-29","2025-12-29",0,0,null,0,0,"00:00:00"]
[18,null,null,null,null,null,null,null,null,null,null,null,null,null,null,null,null,0,"2025-12-29","2025-12-29",0,0,null,0,0,"00:00:00"]
[19,null,null,null,null,null,null,null,null,null,null,null,null,null,null,null,null,0,"2025-12-29","2025-12-29",0,0,null,0,0,"00:00:00"]
[20,null,null,null,null,null,null,null,null,null,null,null,null,null,null,null,null,0,"2025-12-29","2025-12-29",0,0,null,0,0,"00:00:00"]
[21,null,null,null,null,null,null,null,null,null,null,null,null,null,null,null,null,0,"2025-12-29","2025-12-29",0,0,null,0,0,"00:00:00"]
[22,null,null,null,null,null,null,null,null,null,null,null,null,null,null,null,null,0,"2025-12-29","2025-12-29",0,0,null,0,0,"00:00:00"]
[23,null,null,null,null,null,null,null,null,null,null,null,null,null,null,null,null,0,"2025-12-29","2025-12-29",0,0,null,0,0,"00:00:00"]
[24,null,null,null,null,null,null,null,null,null,null,null,null,null,null,null,null,0,"2025-12-29","2025-12-29",0,0,null,0,0,"00:00:00"]
[25,null,null,null,null,null,null,null,null,null,null,null,null,null,null,null,null,0,"2025-12-29","2025-12-29",0,0,null,0,0,"00:00:00"]
[26,null,null,null,null,null,null,null,null,null,null,null,null,null,null,null,null,0,"2025-12-29","2025-12-29",0,0,null,0,0,"00:00:00"]
[27,null,null,null,null,null,null,null,null,null,null,null,null,null,null,null,null,0,"2025-12-29","2025-12-29",0,0,null,0,0,"00:00:00"]
[28,null,null,null,null,null,null,null,null,null,null,null,null,null,null,null,null,0,"2025-12-29","2025-12-29",0,0,null,0,0,"00:00:00"]
[29,null,null,null,null,null,null,null,null,null,null,null,null,null,null,null,null,0,"2025-12-29","2025-12-29",0,0,null,0,0,"00:00:00"]
[30,null,null,null,null,null,null,null,null,null,null,null,null,null,null,null,null,0,"2025-12-29","2025-12-29",0,0,null,0,0,"00:00:00"]
[31,null,null,null,null,null,null,null,null,null,null,null,null,null,null,null,null,0,"2025-12-29","2025-12-29",0,0,null,0,0,"00:00:00"]
[32,null,null,null,null,null,null,null,null,null,null,null,null,null,null,null,null,0,"2025-12-29","2025-12-29",0,0,null,0,0,"00:00:00"]
[33,null,null,null,null,null,null,null,null,null,null,null,null,null,null,null,null,0,"2025-12-29","2025-12-29",0,0,null,0,0,"00:00:00"]
[34,null,null,null,null,null,null,null,null,null,null,null,null,null,null,null,null,0,"2025-12-29","2025-12-29",0,0,null,0,0,"00:00:00"]
[35,null,null,null,null,null,null,null,null,null,null,null,null,null,null,null,null,0,"2025-12-29","2025-12-29",0,0,null,0,0,"00:00:00"]
[36,null,null,null,null,null,null,null,null,null,null,null,null,null,null,null,null,0,"2025-12-29","2025-12-29",0,0,null,0,0,"00:00:00"]
[37,null,null,null,null,null,null,null,null,null,null,null,null,null,null,null,null,0,"2025-12-29","2025-12-29",0,0,null,0,0,"00:00:00"]
[38,null,null,null,null,null,null,null,null,null,null,null,null,null,null,null,null,0,"2025-12-29","2025-12-29",0,0,null,0,0,"00:00:00"]
[39,null,null,null,null,null,null,null,null,null,null,null,null,null,null,null,null,0,"2025-12-29","2025-12-29",0,0,null,0,0,"00:00:00"]
[40,null,null,null,null,null,null,null,null,null,null,null,null,null,null,null,null,0,"2025-12-29","2025-12-29",0,0,null,0,0,"00:00:00"]
[41,null,null,null,null,null,null,null,null,null,null,null,null,null,null,null,null,0,"2025-12-29","2025-12-29",0,0,null,0,0,"00:00:00"]
[42,null,null,null,null,null,null,null,null,null,null,null,null,null,null,null,null,0,"2025-12-29","2025-12-29",0,0,null,0,0,"00:00:00"]
[43,null,null,null,null,null,null,null,null,null,null,null,null,null,null,null,null,0,"2025-12-29","2025-12-29",0,0,null,0,0,"00:00:00"]
[44,null,null,null,null,null,null,null,null,null,null,null,null,null,null,null,null,0,"2025-12-29","2025-12-29",0,0,null,0,0,"00:00:00"]
[45,null,null,null,null,null,null,null,null,null,null,null,null,null,null,null,null,0,"2025-12-29","2025-12-29",0,0,null,0,0,"00:00:00"]
[46,null,null,null,null,null,null,null,null,null,null,null,null,null,null,null,null,0,"2025-12-29","2025-12-29",0,0,null,0,0,"00:00:00"]
[47,null,null,null,null,null,null,null,null,null,null,null,null,null,null,null,null,0,"2025-12-29","2025-12-29",0,0,null,0,0,"00:00:00"]
[48,null,null,null,null,null,null,null,null,null,null,null,null,null,null,null,null,0,"2025-12-29","2025-12-29",0,0,null,0,0,"00:00:00"]
[49,null,null,null,null,null,null,null,null,null,null,null,null,null,null,null,null,0,"2025-12-29","2025-12-29",0,0,null,0,0,"00:00:00"]
[50,null,null,null,null,null,null,null,null,null,null,null,null,null,null,null,null,0,"2025-12-29","2025-12-29",0,0,null,0,0,"00:00:00"]
[51,null,null,null,null,null,null,null,null,null,null,null,null,null,null,null,null,0,"2025-12-29","2025-12-29",0,0,null,0,0,"00:00:00"]
[52,null,null,null,null,null,null,null,null,null,null,null,null,null,null,null,null,0,"2025-12-29","2025-12-29",0,0,null,0,0,"00:00:00"]
[53,null,null,null,null,null,null,null,null,null,null,null,null,null,null,null,null,0,"2025-12-29","2025-12-29",0,0,null,0,0,"00:00:00"]
[54,null,null,null,null,null,null,null,null,null,null,null,null,null,null,null,null,0,"2025-12-29","2025-12-29",0,0,null,0,0,"00:00:00"]
[55,null,null,null,null,null,null,null,null,null,null,null,null,null,null,null,null,0,"2025-12-29","2025-12-29",0,0,null,0,0,"00:00:00"]
[56,null,null,null,null,null,null,null,null,null,null,null,null,null,null,null,null,0,"2025-12-29","2025-12-29",0,0,null,0,0,"00:00:00"]
[57,null,null,null,null,null,null,null,null,null,null,null,null,null,null,null,null,0,"2025-12-29","2025-12-29",0,0,null,0,0,"00:00:00"]
[58,null,null,null,null,null,null,null,null,null,null,null,null,null,null,null,null,0,"2025-12-29","2025-12-29",0,0,null,0,0,"00:00:00"]
[59,null,null,null,null,null,null,null,null,null,null,null,null,null,null,null,null,0,"2025-12-29","2025-12-29",0,0,null,0,0,"00:00:00"]
[60,null,null,null,null,null,null,null,null,null,null,null,null,null,null,null,null,0,"2025-12-29","2025-12-29",0,0,null,0,0,"00:00:00"]
[61,null,null,null,null,null,null,null,null,null,null,null,null,null,null,null,null,0,"2025-12-29","2025-12-29",0,0,null,0,0,"00:00:00"]
[62,null,null,null,null,null,null,null,null,null,null,null,null,null,null,null,null,0,"2025-12-29","2025-12-29",0,0,null,0,0,"00:00:00"]
[63,null,null,null,null,null,null,null,null,null,null,null,null,null,null,null,null,0,"2025-12-29","2025-12-29",0,0,null,0,0,"00:00:00"]
[64,null,null,null,null,null,null,null,null,null,null,null,null,null,null,null,null,0,"2025-12-29","2025-12-29",0,0,null,0,0,"00:00:00"]
[65,null,null,null,null,null,null,null,null,null,null,null,null,null,null,null,null,0,"2025-12-29","2025-12-29",0,0,null,0,0,"00:00:00"]
[66,null,null,null,null,null,null,null,null,null,null,null,null,null,null,null,null,{"$f":"J73","v":0},{"$f":"TODAY()","v":"2025-12-29"},{"$f":"S73","v":"2025-12-29"},{"$f":"B73","v":0},{"$f":"G73","v":0},null,{"$f":"K73","v":0},{"$f":"L73","v":0},{"$f":"E73","v":"00:00:00"}]
[67,null,null,null,null,null,null,null,null,null,null,null,null,null,null,null,null,0,"2025-12-29","2025-12-29",0,0,null,0,0,"00:00:00"]
[68,null,null,null,null,null,null,null,null,null,null,null,null,null,null,null,null,0,"2025-12-29","2025-12-29",0,0,null,0,0,"00:00:00"]
[69,null,null,null,null,null,null,null,null,null,null,null,null,null,null,null,null,0,"2025-12-29","2025-12-29",0,0,null,0,0,"00:00:00"]
[70,null,null,null,null,null,null,null,null,null,null,null,null,null,null,null,null,0,"2025-12-29","2025-12-29",0,0,null,0,0,"00:00:00"]
[71,null,null,null,null,null,null,null,null,null,null,null,null,null,null,null,null,0,"2025-12-29","2025-12-29",0,0,null,0,0,"00:00:00"]
[72,null,null,null,null,null,null,null,null,null,null,null,null,null,null,null,null,0,"2025-12-29","2025-12-29",0,0,null,0,0,"00:00:00"]
[73,null,null,null,null,null,null,null,null,null,null,null,null,null,null,null,null,0,"2025-12-29","2025-12-29",0,0,null,0,0,"00:00:00"]
[74,null,null,null,null,null,null,null,null,null,null,null,null,null,null,null,null,0,"2025-12-29","2025-12-29",0,0,null,0,0,"00:00:00"]
[75,null,null,null,null,null,null,null,null,null,null,null,null,null,null,null,null,0,"2025-12-29","2025-12-29",0,0,null,0,0,"00:00:00"]
[76,null,null,null,null,null,null,null,null,null,null,null,null,null,null,null,null,0,"2025-12-29","2025-12-29",0,0,null,0,0,"00:00:00"]
[77,null,null,null,null,null,null,null,null,null,null,null,null,null,null,null,null,0,"2025-12-29","2025-12-29",0,0,null,0,0,"00:00:00"]
[78,null,null,null,null,null,null,null,null,null,null,null,null,null,null,null,null,0,"2025-12-29","2025-12-29",0,0,null,0,0,"00:00:00"]
[79,null,null,null,null,null,null,null,null,null,null,null,null,null,null,null,null,0,"2025-12-29","2025-12-29",0,0,null,0,0,"00:00:00"]
[80,null,null,null,null,null,null,null,null,null,null,null,null,null,null,null,null,0,"2025-12-29","2025-12-29",0,0,null,0,0,"00:00:00"]
[81,null,null,null,null,null,null,null,null,null,null,null,null,null,null,null,null,0,"2025-12-29","2025-12-29",0,0,null,0,0,"00:00:00"]
[82,null,null,null,null,null,null,null,null,null,null,null,null,null,null,null,null,0,"2025-12-29","2025-12-29",0,0,null,0,0,"00:00:00"]
[83,null,null,null,null,null,null,null,null,null,null,null,null,null,null,null,null,0,"2025-12-29","2025-12-29",0,0,null,0,0,"00:00:00"]
[84,null,null,null,null,null,null,null,null,null,null,null,null,null,null,null,null,0,"2025-12-29","2025-12-29",0,0,null,0,0,"00:00:00"]
[85,null,null,null,null,null,null,null,null,null,null,null,null,null,null,null,null,0,"2025-12-29","2025-12-29",0,0,null,0,0,"00:00:00"]
[86,null,null,null,null,null,null,null,null,null,null,null,null,null,null,null,null,0,"2025-12-29","2025-12-29",0,0,null,0,0,"00:00:00"]
[87,null,null,null,null,null,null,null,null,null,null,null,null,null,null,null,null,0,"2025-12-29","2025-12-29",0,0,null,0,0,"00:00:00"]
[88,null,null,null,null,null,null,null,null,null,null,null,null,null,null,null,null,0,"2025-12-29","2025-12-29",0,0,null,0,0,"00:00:00"]
[89,null,null,null,null,null,null,null,null,null,null,null,null,null,null,null,null,0,"2025-12-29","2025-12-29",0,0,null,0,0,"00:00:00"]
[90,null,null,null,null,null,null,null,null,null,null,null,null,null,null,null,null,0,"2025-12-29","2025-12-29",0,0,null,0,0,"00:00:00"]
[91,null,null,null,null,null,null,null,null,null,null,null,null,null,null,null,null,0,"2025-12-29","2025-12-29",0,0,null,0,0,"00:00:00"]
[92,null,null,null,null,null,null,null,null,null,null,null,null,null,null,null,null,0,"2025-12-29","2025-12-29",0,0,null,0,0,"00:00:00"]
[93,null,null,null,null,null,null,null,null,null,null,null,null,null,null,null,null,0,"2025-12-29","2025-12-29",0,0,null,0,0,"00:00:00"]
[94,null,null,null,null,null,null,null,null,null,null,null,null,null,null,null,null,0,"2025-12-29","2025-12-29",0,0,null,0,0,"00:00:00"]
[95,null,null,null,null,null,null,null,null,null,null,null,null,null,null,null,null,0,"2025-12-29","2025-12-29",0,0,null,0,0,"00:00:00"]
[96,null,null,null,null,null,null,null,null,null,null,null,null,null,null,null,null,0,"2025-12-29","2025-12-29",0,0,null,0,0,"00:00:00"]
[97,null,null,null,null,null,null,null,null,null,null,null,null,null,null,null,null,0,"2025-12-29","2025-12-29",0,0,null,0,0,"00:00:00"]
[98,null,null,null,null,null,null,null,null,null,null,null,null,null,null,null,null,0,"2025-12-29","2025-12-29",0,0,null,0,0,"00:00:00"]
[99,null,null,null,null,null,null,null,null,null,null,null,null,null,null,null,null,0,"2025-12-29","2025-12-29",0,0,null,0,0,"00:00:00"]
[100,null,null,null,null,null,null,null,null,null,null,null,null,null,null,null,null,0,"2025-12-29","2025-12-29",0,0,null,0,0,"00:00:00"]
[101,null,null,null,null,null,null,null,null,null,null,null,null,null,null,null,null,0,"2025-12-29","2025-12-29",0,0,null,0,0,"00:00:00"]
[102,null,null,null,null,null,null,null,null,null,null,null,null,null,null,null,null,0,"2025-12-29","2025-12-29",0,0,null,0,0,"00:00:00"]
[103,null,null,null,null,null,null,null,null,null,null,null,null,null,null,null,null,0,"2025-12-29","2025-12-29",0,0,null,0,0,"00:00:00"]
[104,null,null,null,null,null,null,null,null,null,null,null,null,null,null,null,null,0,"2025-12-29","2025-12-29",0,0,null,0,0,"00:00:00"]
[105,null,null,null,null,null,null,null,null,null,null,null,null,null,null,null,null,0,"2025-12-29","2025-12-29",0,0,null,0,0,"00:00:00"]
[106,null,null,null,null,null,null,null,null,null,null,null,null,null,null,null,null,0,"2025-12-29","2025-12-29",0,0,null,0,0,"00:00:00"]
[107,null,null,null,null,null,null,null,null,null,null,null,null,null,null,null,null,0,"2025-12-29","2025-12-29",0,0,null,0,0,"00:00:00"]
[108,null,null,null,null,null,null,null,null,null,null,null,null,null,null,null,null,0,"2025-12-29","2025-12-29",0,0,null,0,0,"00:00:00"]
[109,null,null,null,null,null,null,null,null,null,null,null,null,null,null,null,null,0,"2025-12-29","2025-12-29",0,0,null,0,0,"00:00:00"]
[110,null,null,null,null,null,null,null,null,null,null,null,null,null,null,null,null,0,"2025-12-29","2025-12-29",0,0,null,0,0,"00:00:00"]
[111,null,null,null,null,null,null,null,null,null,null,null,null,null,null,null,null,0,"2025-12-29","2025-12-29",0,0,null,0,0,"00:00:00"]
[112,null,null,null,null,null,null,null,null,null,null,null,null,null,null,null,null,0,"2025-12-29","2025-12-29",0,0,null,0,0,"00:00:00"]
[113,null,null,null,null,null,null,null,null,null,null,null,null,null,null,null,null,0,"2025-12-29","2025-12-29",0,0,null,0,0,"00:00:00"]
{"$rows_left_out":88}
{"sheet":"SVSE Cheque bedrucken","index":1,"n_rows":24,"n_cols":17,"rows_kept":24,"cut":false,"hidden":false,"merged":[[0,3,3,10],[0,11,1,15],[2,16,2,17],[3,16,4,17]]}
[null,null,null,"SVSE Urlaubs-Cheque bedrucken",null,null,null,null,null,null,null,"Für diejenigen wo die Checks selber ausdrucken, können dies mit dieser Mappe mache. \nUnten einfach die Auswahl des Datums anwählen und drucken"]
[]
[null,null,null,null,null,null,null,null,null,null,null,null,null,null,null,null,"Checknummer"]
[null,null,null,null,null,null,null,null,null,null,null,null,null,null,null,null,{"$f":"Start!C7","v":0}]
[null,null,null,null,"Hier keine Daten ändern !!!"]
[]
[]
[]
[]
[]
[]
[" "]
[null,{"$f":"Start!C11","v":0},null,null,null,null,{"$f":"B13","v":0}]
[]
[null,{"$f":"Start!C15","v":0},null,null,null,null,{"$f":"B15","v":0}]
[]
[null,{"$f":"Start!C19","v":0},null,null,null,null,{"$f":"B17","v":0}]
[]
[]
[null,{"$f":"Start!C23","v":"00:00:00"},null,null,null,null,{"$f":"B20","v":"00:00:00"}]
[]
[null,{"$f":"Start!C27","v":"00:00:00"}]
[]
[null,{"$f":"Start!C31","v":0}]

{"sheet":"Couvert drucken","index":2,"n_rows":15,"n_cols":13,"rows_kept":15,"cut":false,"hidden":false,"merged":[[37,12,42,17],[45,0,45,2],[0,0,0,10],[11,7,11,10],[12,7,12,8],[12,9,12,10],[37,4,42,10]]}
[]
[]
[]
[]
[]
[null,null,null,null,null,"Martin Brupbacher"]
[null,null,null,null,null,"Feldmatt 12"]
[null,null,null,null,null,"6030 Ebikon"]
[]
[]
[null,null,null,null,null,null,null,{"$f":"VLOOKUP(M15,'EINGABE Name + Funktion'!A8:P107,2)","v":0}]
[null,null,null,null,null,null,null,{"$f":"VLOOKUP(M15,'EINGABE Name + Funktion'!A8:P107,14)","v":0}]
[null,null,null,null,null,null,null,{"$f":"VLOOKUP(M15,'EINGABE Name + Funktion'!A8:P107,15)","v":0},null,{"$f":"VLOOKUP(M15,'EINGABE Name + Funktion'!A8:P107,16)","v":0}]
[]
[null,null,null,null,null,null,null,null,null,null,null,null,1]

{"sheet":"Start","index":3,"n_rows":39,"n_cols":10,"rows_kept":39,"cut":false,"hidden":false,"merged":[[26,2,28,4],[30,2,32,4],[0,3,3,10],[10,2,12,4],[14,2,16,4],[18,2,20,4],[22,2,24,4],[4,0,4,7],[6,2,8,4],[6,0,8,1]]}
[null,null,null,"SVSE Urlaubs-Cheque bedrucken"]
[]
[]
[]
["Hier keine Daten ändern !!!"]
[]
["Check Nr.",null,{"$f":"IF(J27<>\"\",VLOOKUP(J27,'EINGABE Name + Funktion'!A8:J107,10),\" \")","v":0}]
[]
[]
[]
["Name, Vorname:",null,{"$f":"IF(J27<>\"\",VLOOKUP(J27,'EINGABE Name + Funktion'!A8:G107,2),\" \")","v":0}]
["Nom, prénom:"]
["Cognome, Nome:"]
[]
["Beschäftigung:",null,{"$f":"IF(J27<>\"\",VLOOKUP(J27,'EINGABE Name + Funktion'!A8:G107,3),\" \")","v":0}]
["Fonction:"]
["Attività:"]
[]
["Arbeitsort:",null,{"$f":"IF(J27<>\"\",VLOOKUP(J27,'EINGABE Name + Funktion'!A8:G107,4),\" \")","v":0}]
["Lieu de travail:"]
["Luogo di lavoro:"]
[]
["Datum des Urlaubes:",null,{"$f":"IF(J27<>\"\",VLOOKUP(J27,'EINGABE Name + Funktion'!A8:G107,5),\" \")","v":"00:00:00"}]
["Data du congé:"]
["Data del congedo:"]
[]
["Grund:",null,{"$f":"IF(J27<>\"\",VLOOKUP(J27,'EINGABE Name + Funktion'!A8:G107,6),\" \")","v":"00:00:00"},null,null,null,null,null,null,1]
["Motif:"]
["Motivo:"]
[]
["Konto:",null,{"$f":"IF(J27<>\"\",VLOOKUP(J27,'EINGABE Name + Funktion'!A8:G107,7),\" \")","v":0}]
["Compte:"]
["Conto:"]
[]
[]
[]
[]
["erstellt durch © by: M.Brupbacher martin.brupbacher@svse.ch"]
[{"$f":"'EINGABE Name + Funktion'!R6","v":"Version: 2.0  / 29.12.2025\nerstellt durch M.Brupbacher"}]